Reaction Details
TargetSerine/threonine-protein kinase Chk1
LigandBDBM50255167
Substrate/Competitorn/a
Meas. Tech.ChEMBL_1686958 (CHEMBL4037437)
IC50 6±n/a nM
Citation Yang, BVasbinder, MMHird, AWSu, QWang, HYu, YToader, DLyne, PDRead, JABreed, JIoannidis, SDeng, CGrondine, MDeGrace, NWhitston, DBrassil, PJanetka, JW Adventures in Scaffold Morphing: Discovery of Fused Ring Heterocyclic Checkpoint Kinase 1 (CHK1) Inhibitors. J Med Chem61:1061-1073 (2018) 
 
Serine/threonine-protein kinase Chk1
Name:Serine/threonine-protein kinase Chk1
Type:Enzyme Catalytic Domain
Mol. Mass.:54443.02
Organism:Homo sapiens (Human)
Description:gi_166295192
Residue:476
BDBM50255167
NameBDBM50255167
Synonyms:CHEMBL4066751
TypeSmall organic molecule
Emp. Form.C17H20N6OS
Mol. Mass.356.445
SMILESCn1cc(cn1)-c1cc2c(N[C@H]3CCCNC3)ncc(C(N)=O)c2s1