Reaction Details
TargetSerine/threonine-protein kinase Chk1
LigandBDBM50255210
Substrate/Competitorn/a
Meas. Tech.ChEBML_1686958
IC50 10.0±n/a nM
Citation Yang, BVasbinder, MMHird, AWSu, QWang, HYu, YToader, DLyne, PDRead, JABreed, JIoannidis, SDeng, CGrondine, MDeGrace, NWhitston, DBrassil, PJanetka, JW Adventures in Scaffold Morphing: Discovery of Fused Ring Heterocyclic Checkpoint Kinase 1 (CHK1) Inhibitors. J Med Chem61:1061-1073 (2018) 
 
Serine/threonine-protein kinase Chk1
Name:Serine/threonine-protein kinase Chk1
Type:Enzyme Catalytic Domain
Mol. Mass.:54443.02
Organism:Homo sapiens (Human)
Description:gi_166295192
Residue:476
BDBM50255210
NameBDBM50255210
Synonyms:CHEMBL4082801
TypeSmall organic molecule
Emp. Form.C19H20N4O2S
Mol. Mass.368.453
SMILESNC(=O)c1cnc(N[C@H]2CNCC[C@@H]2O)c2cc(sc12)-c1ccccc1