Reaction Details
TargetTyrosine-protein phosphatase non-receptor type 1
LigandBDBM50256794
Substrate/Competitorn/a
Meas. Tech.ChEMBL_1688187 (CHEMBL4038757)
Ki 4380±n/a nM
Citation Tan, XFUddin, ZPark, CSong, YHSon, MLee, KWPark, KH Competitive protein tyrosine phosphatase 1B (PTP1B) inhibitors, prenylated caged xanthones from Garcinia hanburyi and their inhibitory mechanism. Bioorg Med Chem25:2498-2506 (2017) 
 
Tyrosine-protein phosphatase non-receptor type 1
Name:Tyrosine-protein phosphatase non-receptor type 1
Type:Protein phosphatase
Mol. Mass.:49963.76
Organism:Homo sapiens (Human)
Description:Human recombinant GST-fusion PTP1B (1-435).
Residue:435
BDBM50256794
NameBDBM50256794
Synonyms:CHEMBL4059800
TypeSmall organic molecule
Emp. Form.C39H48O7
Mol. Mass.628.7942
SMILES[H][C@@]12[#6][C@@]3([H])[#6](-[#8]-[#6])=[#6]4-[#6](=O)-c5c(-[#8])c6-[#6]=[#6][C@@]([#6])([#6]-[#6]\[#6]=[#6](\[#6])-[#6])[#8]-c6c(-[#6]\[#6]=[#6](\[#6])-[#6])c5-[#8][C@@]14[C@@]([#6]\[#6]=[#6](/[#6])-[#6])([#8]C2([#6])[#6])[#6]3=O