Reaction Details
TargetTyrosine-protein phosphatase non-receptor type 1
LigandBDBM50256790
Substrate/Competitorn/a
Meas. Tech.ChEBML_1688196
Ki 1490±n/a nM
Citation Tan, XFUddin, ZPark, CSong, YHSon, MLee, KWPark, KH Competitive protein tyrosine phosphatase 1B (PTP1B) inhibitors, prenylated caged xanthones from Garcinia hanburyi and their inhibitory mechanism. Bioorg Med Chem25:2498-2506 (2017) 
 
Tyrosine-protein phosphatase non-receptor type 1
Name:Tyrosine-protein phosphatase non-receptor type 1
Type:Protein phosphatase
Mol. Mass.:49963.76
Organism:Homo sapiens (Human)
Description:Human recombinant GST-fusion PTP1B (1-435).
Residue:435
BDBM50256790
NameBDBM50256790
Synonyms:CHEMBL4068566
TypeSmall organic molecule
Emp. Form.C32H34O8
Mol. Mass.546.6076
SMILES[H][C@@]12[#6][C@@]3([H])[#6]=[#6]4-[#6](=O)-c5c(-[#8])c6-[#6]=[#6]C([#6])([#6])[#8]-c6c(-[#6]\[#6]=[#6](/[#6])-[#6])c5-[#8][C@@]14[C@]([#8]C2([#6])[#6])(\[#6]=[#6](\[#6])-[#6](-[#8])=O)[#6]3=O