Reaction Details
TargetBromodomain-containing protein 4
LigandBDBM298350
Substrate/Competitorn/a
Meas. Tech.ChEMBL_1692524 (CHEMBL4043414)
Kd 0.430000±n/a nM
Citation Liu, ZWang, PChen, HWold, EATian, BBrasier, ARZhou, J Drug Discovery Targeting Bromodomain-Containing Protein 4. J Med Chem60:4533-4558 (2017) 
 
Bromodomain-containing protein 4
Name:Bromodomain-containing protein 4
Type:Protein
Mol. Mass.:152264.84
Organism:Homo sapiens (Human)
Description:O60885
Residue:1362
BDBM298350
NameBDBM298350
Synonyms:US10124009, Compound 5
TypeSmall organic molecule
Emp. Form.C25H29ClN4O3S
Mol. Mass.501.041
SMILESCc1sc-2c(c1C)C(=N[C@@H](CC(=O)OCCCCCCO)c1nnc(C)n-21)c1ccc(Cl)cc1