Reaction Details
TargetBroad substrate specificity ATP-binding cassette transporter ABCG2
LigandBDBM50260356
Substrate/Competitorn/a
Meas. Tech.ChEBML_1693601
IC50 13300±n/a nM
Citation Namanja-Magliano, HABohn, KAgrawal, NWilloughby, MEHrycyna, CAChmielewski, J Dual inhibitors of the human blood-brain barrier drug efflux transporters P-glycoprotein and ABCG2 based on the antiviral azidothymidine. Bioorg Med Chem25:5128-5132 (2017) 
 
Broad substrate specificity ATP-binding cassette transporter ABCG2
Name:Broad substrate specificity ATP-binding cassette transporter ABCG2
Type:Multi-pass membrane protein; monomer or homodimer; disulfide-linked
Mol. Mass.:72329.48
Organism:Homo sapiens (Human)
Description:Q9UNQ0
Residue:655
BDBM50260356
NameBDBM50260356
Synonyms:CHEMBL2063072
TypeSmall organic molecule
Emp. Form.C34H48N10O10
Mol. Mass.756.8059
SMILESCc1cn([C@H]2C[C@H](N=[N+]=[N-])[C@@H](COC(=O)CCCCCCCCCCCCC(=O)OC[C@H]3O[C@H](C[C@@H]3N=[N+]=[N-])n3cc(C)c(=O)[nH]c3=O)O2)c(=O)[nH]c1=O