Reaction Details
TargetATP-dependent translocase ABCB1
LigandBDBM50260355
Substrate/Competitorn/a
Meas. Tech.ChEBML_1693600
IC50 9300±n/a nM
Citation Namanja-Magliano, HABohn, KAgrawal, NWilloughby, MEHrycyna, CAChmielewski, J Dual inhibitors of the human blood-brain barrier drug efflux transporters P-glycoprotein and ABCG2 based on the antiviral azidothymidine. Bioorg Med Chem25:5128-5132 (2017) 
 
ATP-dependent translocase ABCB1
Name:ATP-dependent translocase ABCB1
Type:Protein
Mol. Mass.:141503.50
Organism:Homo sapiens (Human)
Description:P08183
Residue:1280
BDBM50260355
NameBDBM50260355
Synonyms:CHEMBL2063071
TypeSmall organic molecule
Emp. Form.C32H44N10O10
Mol. Mass.728.7528
SMILESCc1cn([C@H]2C[C@H](N=[N+]=[N-])[C@@H](COC(=O)CCCCCCCCCCC(=O)OC[C@H]3O[C@H](C[C@@H]3N=[N+]=[N-])n3cc(C)c(=O)[nH]c3=O)O2)c(=O)[nH]c1=O