Reaction Details
TargetCoagulation factor XI
LigandBDBM50260647
Substrate/Competitorn/a
Meas. Tech.ChEBML_1694491
Ki 0.320000±n/a nM
Citation Wang, CCorte, JRRossi, KABozarth, JMWu, YSheriff, SMyers, JELuettgen, JMSeiffert, DAWexler, RRQuan, ML Macrocyclic factor XIa inhibitors. Bioorg Med Chem Lett27:4056-4060 (2017) 
 
Coagulation factor XI
Name:Coagulation factor XI
Type:Enzyme
Mol. Mass.:70130.58
Organism:Homo sapiens (Human)
Description:P03951
Residue:625
BDBM50260647
NameBDBM50260647
Synonyms:CHEMBL4067274
TypeSmall organic molecule
Emp. Form.C31H27ClN10O4
Mol. Mass.639.064
SMILESCOC(=O)Nc1ccc2-c3c[nH]c(n3)[C@H](Cc3cccc(CCC(=O)Nc2c1)n3)NC(=O)\C=C\c1cc(Cl)ccc1-n1cnnn1