Reaction Details
TargetTyrosine-protein kinase JAK3
LigandBDBM50261794
Substrate/Competitorn/a
Meas. Tech.ChEBML_1696339
IC50<1.000000±n/a nM
Citation Kempson, JOvalle, DGuo, JWrobleski, STLin, SSpergel, SHDuan, JJJiang, BLu, ZDas, JYang, BVHynes, JWu, HTokarski, JSack, JSKhan, JSchieven, GBlatt, YChaudhry, CSalter-Cid, LMFura, ABarrish, JCCarter, PHPitts, WJ Discovery of highly potent, selective, covalent inhibitors of JAK3. Bioorg Med Chem Lett27:4622-4625 (2017) 
 
Tyrosine-protein kinase JAK3
Name:Tyrosine-protein kinase JAK3
Type:Protein
Mol. Mass.:125111.08
Organism:Homo sapiens (Human)
Description:P52333
Residue:1124
BDBM50261794
NameBDBM50261794
Synonyms:CHEMBL4065693
TypeSmall organic molecule
Emp. Form.C22H21N5O2
Mol. Mass.387.4344
SMILESNC(=O)c1cnc(Nc2ccccc2)cc1NCc1cccc(NC(=O)C=C)c1