Reaction Details
TargetTyrosine-protein kinase JAK3
LigandBDBM50261773
Substrate/Competitorn/a
Meas. Tech.ChEBML_1696339
IC50 1.3±n/a nM
Citation Kempson, JOvalle, DGuo, JWrobleski, STLin, SSpergel, SHDuan, JJJiang, BLu, ZDas, JYang, BVHynes, JWu, HTokarski, JSack, JSKhan, JSchieven, GBlatt, YChaudhry, CSalter-Cid, LMFura, ABarrish, JCCarter, PHPitts, WJ Discovery of highly potent, selective, covalent inhibitors of JAK3. Bioorg Med Chem Lett27:4622-4625 (2017) 
 
Tyrosine-protein kinase JAK3
Name:Tyrosine-protein kinase JAK3
Type:Protein
Mol. Mass.:125111.08
Organism:Homo sapiens (Human)
Description:P52333
Residue:1124
BDBM50261773
NameBDBM50261773
Synonyms:CHEMBL4092337
TypeSmall organic molecule
Emp. Form.C18H17N5O2
Mol. Mass.335.3599
SMILESNC(=O)c1cnn2cccc2c1NCc1cccc(NC(=O)C=C)c1