Reaction Details
TargetGastrin/cholecystokinin type B receptor
LigandBDBM50406488
Substrate/Competitorn/a
Meas. Tech.ChEBML_47674
IC50 92±n/a nM
Citation Tilley, JWDanho, WLovey, KWagner, RSwistok, JMakofske, RMichalewsky, JTriscari, JNelson, DWeatherford, S Carboxylic acids and tetrazoles as isosteric replacements for sulfate in cholecystokinin analogues. J Med Chem34:1125-36 (1991) Gastrin/cholecystokinin type B receptor
Name:Gastrin/cholecystokinin type B receptor
Type:PROTEIN
Mol. Mass.:48807.54
Organism:Bos taurus
Description:ChEMBL_48437
Residue:454
BDBM50406488
NameBDBM50406488
Synonyms:CHEMBL2079550
TypeSmall organic molecule
Emp. Form.C49H59F2N9O12S2
Mol. Mass.1068.173
SMILESCSCC[C@H](NC(=O)[C@H](Cc1ccc(cc1)C(F)(F)C(O)=O)NC(C)=O)C(=O)NCC(=O)N[C@@H](Cc1c[nH]c2ccccc12)C(=O)N[C@@H](CCSC)C(=O)N[C@@H](CC(O)=O)C(=O)N[C@@H](Cc1ccccc1)C(N)=O