Reaction Details
TargetHistone-lysine N-methyltransferase EHMT1
LigandBDBM50268865
Substrate/Competitorn/a
Meas. Tech.ChEMBL_1705438 (CHEMBL4056671)
IC50 20±n/a nM
Citation Xiong, YLi, FBabault, NWu, HDong, AZeng, HChen, XArrowsmith, CHBrown, PJLiu, JVedadi, MJin, J Structure-activity relationship studies of G9a-like protein (GLP) inhibitors. Bioorg Med Chem25:4414-4423 (2017) 
 
Histone-lysine N-methyltransferase EHMT1
Name:Histone-lysine N-methyltransferase EHMT1
Type:PROTEIN
Mol. Mass.:141443.67
Organism:Homo sapiens (Human)
Description:ChEMBL_1450367
Residue:1298
BDBM50268865
NameBDBM50268865
Synonyms:CHEMBL4068291
TypeSmall organic molecule
Emp. Form.C24H37N5O2
Mol. Mass.427.5829
SMILESCOc1cc2nc(nc(NC3CCN(C)CC3)c2cc1OC)N(C)CC1CCCCC1