Reaction Details
TargetHistone-lysine N-methyltransferase EHMT1
LigandBDBM50268868
Substrate/Competitorn/a
Meas. Tech.ChEMBL_1705438 (CHEMBL4056671)
IC50 58±n/a nM
Citation Xiong, YLi, FBabault, NWu, HDong, AZeng, HChen, XArrowsmith, CHBrown, PJLiu, JVedadi, MJin, J Structure-activity relationship studies of G9a-like protein (GLP) inhibitors. Bioorg Med Chem25:4414-4423 (2017) 
 
Histone-lysine N-methyltransferase EHMT1
Name:Histone-lysine N-methyltransferase EHMT1
Type:PROTEIN
Mol. Mass.:141443.67
Organism:Homo sapiens (Human)
Description:ChEMBL_1450367
Residue:1298
BDBM50268868
NameBDBM50268868
Synonyms:CHEMBL4082847
TypeSmall organic molecule
Emp. Form.C20H31N5O3
Mol. Mass.389.4918
SMILESCOCCN(C)c1nc(NC2CCN(C)CC2)c2cc(OC)c(OC)cc2n1