Reaction Details
TargetHistone-lysine N-methyltransferase EHMT2
LigandBDBM50268903
Substrate/Competitorn/a
Meas. Tech.ChEMBL_1705439 (CHEMBL4056672)
IC50 443±n/a nM
Citation Xiong, YLi, FBabault, NWu, HDong, AZeng, HChen, XArrowsmith, CHBrown, PJLiu, JVedadi, MJin, J Structure-activity relationship studies of G9a-like protein (GLP) inhibitors. Bioorg Med Chem25:4414-4423 (2017) 
 
Histone-lysine N-methyltransferase EHMT2
Name:Histone-lysine N-methyltransferase EHMT2
Type:Enzyme
Mol. Mass.:132339.87
Organism:Homo sapiens (Human)
Description:Q96KQ7
Residue:1210
BDBM50268903
NameBDBM50268903
Synonyms:CHEMBL4101782
TypeSmall organic molecule
Emp. Form.C23H37N5O2
Mol. Mass.415.5722
SMILESCCCCN(CCC)c1nc(NC2CCN(C)CC2)c2cc(OC)c(OC)cc2n1