Reaction Details
TargetHistone-lysine N-methyltransferase EHMT2
LigandBDBM50268871
Substrate/Competitorn/a
Meas. Tech.ChEMBL_1705439 (CHEMBL4056672)
IC50 177±n/a nM
Citation Xiong, YLi, FBabault, NWu, HDong, AZeng, HChen, XArrowsmith, CHBrown, PJLiu, JVedadi, MJin, J Structure-activity relationship studies of G9a-like protein (GLP) inhibitors. Bioorg Med Chem25:4414-4423 (2017) 
 
Histone-lysine N-methyltransferase EHMT2
Name:Histone-lysine N-methyltransferase EHMT2
Type:Enzyme
Mol. Mass.:132339.87
Organism:Homo sapiens (Human)
Description:Q96KQ7
Residue:1210
BDBM50268871
NameBDBM50268871
Synonyms:CHEMBL4100004
TypeSmall organic molecule
Emp. Form.C23H35N5O2
Mol. Mass.413.5563
SMILESCOc1cc2nc(nc(NC3CCN(C)CC3)c2cc1OC)N(C)C1CCCCC1