Reaction Details
TargetThymidylate synthase
LigandBDBM50014501
Substrate/Competitorn/a
Meas. Tech.ChEBML_209796
IC50 43±n/a nM
Citation Marsham, PRJackman, ALOldfield, JHughes, LRThornton, TJBisset, GMO'Connor, BMBishop, JACalvert, AH Quinazoline antifolate thymidylate synthase inhibitors: benzoyl ring modifications in the C2-methyl series. J Med Chem33:3072-8 (1990) Thymidylate synthase
Name:Thymidylate synthase
Type:PROTEIN
Mol. Mass.:34957.15
Organism:Mus musculus
Description:ChEMBL_1340097
Residue:307
BDBM50014501
NameBDBM50014501
Synonyms:(S)-2-(2-fluoro-4-((2-fluoroethyl)((2-methyl-4-oxo-3,4-dihydroquinazolin-6-yl)methyl)amino)benzamido)pentanedioic acid CHEMBL104358
TypeSmall organic molecule
Emp. Form.C24H24F2N4O6
Mol. Mass.502.4674
SMILESCc1nc2ccc(CN(CCF)c3ccc(C(=O)N[C@@H](CCC(O)=O)C(O)=O)c(F)c3)cc2c(=O)[nH]1