Reaction Details
TargetThymidylate synthase
LigandBDBM50014518
Substrate/Competitorn/a
Meas. Tech.ChEBML_209796
IC50 67±n/a nM
Citation Marsham, PRJackman, ALOldfield, JHughes, LRThornton, TJBisset, GMO'Connor, BMBishop, JACalvert, AH Quinazoline antifolate thymidylate synthase inhibitors: benzoyl ring modifications in the C2-methyl series. J Med Chem33:3072-8 (1990) Thymidylate synthase
Name:Thymidylate synthase
Type:PROTEIN
Mol. Mass.:34957.15
Organism:Mus musculus
Description:ChEMBL_1340097
Residue:307
BDBM50014518
NameBDBM50014518
Synonyms:(S)-2-(2-methoxy-4-(((2-methyl-4-oxo-3,4-dihydroquinazolin-6-yl)methyl)(prop-2-ynyl)amino)benzamido)pentanedioic acid CHEMBL323363
TypeSmall organic molecule
Emp. Form.C26H26N4O7
Mol. Mass.506.5072
SMILESCOc1cc(ccc1C(=O)N[C@@H](CCC(O)=O)C(O)=O)N(CC#C)Cc1ccc2nc(C)[nH]c(=O)c2c1