Reaction Details
TargetVasopressin V2 receptor
LigandBDBM50016754
Substrate/Competitorn/a
Meas. Tech.ChEBML_214867
Ki 8.3±n/a nM
Citation Callahan, JFAshton-Shue, DBryan, HGBryan, WMHeckman, GDKinter, LBMcDonald, JEMoore, MLSchmidt, DBSilvestri, JS Structure-activity relationships of novel vasopressin antagonists containing C-terminal diaminoalkanes and (aminoalkyl)guanidines. J Med Chem32:391-6 (1989) Vasopressin V2 receptor
Name:Vasopressin V2 receptor
Type:PROTEIN
Mol. Mass.:40556.17
Organism:Sus scrofa
Description:ChEMBL_214870
Residue:370
BDBM50016754
NameBDBM50016754
Synonyms:1-[20-Benzyl-14-carbamoylmethyl-23-(4-ethoxy-benzyl)-17-isopropyl-13,16,19,22,25-pentaoxo-7,9-dithia-12,15,18,21,24-pentaaza-spiro[5.20]hexacosane-11-carbonyl]-pyrrolidine-2-carboxylic acid (5-amino-pentyl)-amide | CHEMBL409667
TypeSmall organic molecule
Emp. Form.C51H75N9O9S2
Mol. Mass.1022.326
SMILESCCOc1ccc(C[C@H]2NC(=O)CC3(CCCCC3)SCSC[C@@H](NC(=O)[C@@H](CC(N)=O)NC(=O)[C@@H](NC(=O)[C@@H](Cc3ccccc3)NC2=O)C(C)C)C(=O)N2CCCC2C(=O)NCCCCCN)cc1