Reaction Details
TargetVasopressin V2 receptor
LigandBDBM50016752
Substrate/Competitorn/a
Meas. Tech.ChEMBL_214867 (CHEMBL820053)
Ki 2.9±n/a nM
Citation Callahan, JFAshton-Shue, DBryan, HGBryan, WMHeckman, GDKinter, LBMcDonald, JEMoore, MLSchmidt, DBSilvestri, JS Structure-activity relationships of novel vasopressin antagonists containing C-terminal diaminoalkanes and (aminoalkyl)guanidines. J Med Chem32:391-6 (1989) Vasopressin V2 receptor
Name:Vasopressin V2 receptor
Type:PROTEIN
Mol. Mass.:40556.17
Organism:Sus scrofa
Description:ChEMBL_214870
Residue:370
BDBM50016752
NameBDBM50016752
Synonyms:CHEMBL339943 | N*1*-[1-(1-Carbamoyl-4-guanidino-butylcarbamoyl)-2-mercapto-ethyl]-2-[2-(2-{3-(4-ethoxy-phenyl)-2-[2-(1-mercapto-cyclohexyl)-acetylamino]-propionylamino}-3-phenyl-propionylamino)-3-methyl-butyrylamino]-succinamide
TypeSmall organic molecule
Emp. Form.C47H69N11O9S2
Mol. Mass.996.249
SMILESCCOc1ccc(C[C@H]2NC(=O)CC3(CCCCC3)SCSC[C@@H](NC(=O)[C@@H](CC(N)=O)NC(=O)[C@@H](NC(=O)[C@@H](Cc3ccccc3)NC2=O)C(C)C)C(=O)N[C@H](CCCNC(N)=N)C(N)=O)cc1