Reaction Details
TargetProtease
LigandBDBM8125
Substrate/Competitorn/a
Meas. Tech.ChEMBL_1729863 (CHEMBL4145141)
EC50 112±n/a nM
Citation Hidaka, KKimura, TSankaranarayanan, RWang, JMcDaniel, KFKempf, DJKameoka, MAdachi, MKuroki, RNguyen, JTHayashi, YKiso, Y Identification of Highly Potent Human Immunodeficiency Virus Type-1 Protease Inhibitors against Lopinavir and Darunavir Resistant Viruses from Allophenylnorstatine-Based Peptidomimetics with P2 Tetrahydrofuranylglycine. J Med Chem61:5138-5153 (2018) 
 
Protease
Name:Protease
Synonyms:n/a
Type:Enzyme
Mol. Mass.:10904.79
Organism:Human immunodeficiency virus 1 (HIV-1)
Description:Q9YQ12
Residue:99
BDBM8125
NameBDBM8125
TypeSmall organic molecule
Emp. Form.C27H37N3O7S
Mol. Mass.547.664
SMILES[H][C@@]1(CO[C@@]2([H])OCC[C@@]12[H])OC(=O)N[C@@H](Cc1ccccc1)[C@H](O)CN(CC(C)C)S(=O)(=O)c1ccc(N)cc1