Reaction Details
TargetReverse transcriptase
LigandBDBM2483
Substrate/Competitorn/a
Meas. Tech.ChEMBL_1731684 (CHEMBL4147220)
IC50 2.0±n/a nM
Citation Jin, KYin, HDe Clercq, EPannecouque, CMeng, GChen, F Discovery of biphenyl-substituted diarylpyrimidines as non-nucleoside reverse transcriptase inhibitors with high potency against wild-type and mutant HIV-1. Eur J Med Chem145:726-734 (2018) 
 
Reverse transcriptase
Name:Reverse transcriptase
Synonyms:n/a
Type:Protein
Mol. Mass.:29598.37
Organism:Human immunodeficiency virus 1
Description:Q9WKE8
Residue:254
BDBM2483
NameBDBM2483
TypeSmall organic molecule
Emp. Form.C14H9ClF3NO2
Mol. Mass.315.675
SMILESFC(F)(F)[C@]1(OC(=O)Nc2ccc(Cl)cc12)C#CC1CC1