Reaction Details
TargetBromodomain-containing protein 4
LigandBDBM50457489
Substrate/Competitorn/a
Meas. Tech.ChEMBL_1759876 (CHEMBL4194884)
Ki 0.620000±n/a nM
Citation Fidanze, SDLiu, DMantei, RAHasvold, LAPratt, JKSheppard, GSWang, LHolms, JHDai, YAguirre, ABogdan, ADietrich, JDMarjanovic, JPark, CHHutchins, CWLin, XBui, MHHuang, XWilcox, DLi, LWang, RKovar, PMagoc, TJRajaraman, GAlbert, DHShen, YKati, WMMcDaniel, KF Discovery and optimization of novel constrained pyrrolopyridone BET family inhibitors. Bioorg Med Chem Lett28:1804-1810 (2018) 
 
Bromodomain-containing protein 4
Name:Bromodomain-containing protein 4
Type:Protein
Mol. Mass.:152264.84
Organism:Homo sapiens (Human)
Description:O60885
Residue:1362
BDBM50457489
NameBDBM50457489
Synonyms:CHEMBL4208129
TypeSmall organic molecule
Emp. Form.C22H20N4O3S
Mol. Mass.420.484
SMILESCn1cc2-c3cc(CS(C)(=O)=O)ccc3N(Cc3c[nH]c(c23)c1=O)c1ccccn1