Reaction Details
TargetRenin
LigandBDBM50022591
Substrate/Competitorn/a
Meas. Tech.ChEBML_195773
IC50 20±n/a nM
Citation Bühlmayer, PCaselli, AFuhrer, WGöschke, RRasetti, VRüeger, HStanton, JLCriscione, LWood, JM Synthesis and biological activity of some transition-state inhibitors of human renin. J Med Chem31:1839-46 (1988) Renin
Name:Renin
Type:Enzyme
Mol. Mass.:45058.99
Organism:Homo sapiens (Human)
Description:n/a
Residue:406
BDBM50022591
NameBDBM50022591
Synonyms:2,2-Dimethyl-propionic acid 1-[1-(4-{1-[1-carbamoyl-2-(3H-imidazol-4-yl)-ethylcarbamoyl]-2-methyl-butylcarbamoyl}-2-hydroxy-1-isobutyl-5-methyl-hexylcarbamoyl)-2-(3H-imidazol-4-yl)-ethylcarbamoyl]-1-phenyl-ethyl ester | CHEMBL54655
TypeSmall organic molecule
Emp. Form.C44H67N9O8
Mol. Mass.850.0583
SMILESCC[C@H](C)[C@H](NC(=O)[C@@H](CC(O)[C@H](CC(C)C)NC(=O)[C@H](Cc1cnc[nH]1)NC(=O)C(C)(OC(=O)C(C)(C)C)c1ccccc1)C(C)C)C(=O)N[C@@H](Cc1cnc[nH]1)C(N)=O