Reaction Details
TargetAurora kinase B
LigandBDBM50460788
Substrate/Competitorn/a
Meas. Tech.ChEMBL_1770329 (CHEMBL4222441)
EC50 356±n/a nM
Citation Yu, TZhang, YKerekes, ADTagat, JRDoll, RJXiao, YEsposite, SHruza, ABelanger, DBVoss, MRainka, MPBasso, ALiu, MLiang, LSui, NPrelusky, DRindgen, DZhang, L Discovery of a highly potent orally bioavailable imidazo-[1, 2-a]pyrazine Aurora inhibitor. Bioorg Med Chem Lett28:1397-1403 (2018) 
 
Aurora kinase B
Name:Aurora kinase B
Type:Protein
Mol. Mass.:39327.72
Organism:Homo sapiens (Human)
Description:Q96GD4
Residue:344
BDBM50460788
NameBDBM50460788
Synonyms:CHEMBL4226969
TypeSmall organic molecule
Emp. Form.C20H18N8OS
Mol. Mass.418.475
SMILESCOc1cccc(Cc2cc(Nc3nc(C)cn4c(cnc34)-c3cn[nH]c3)sn2)n1