Reaction Details
TargetMitogen-activated protein kinase 1
LigandBDBM103290
Substrate/Competitorn/a
Meas. Tech.ChEMBL_1772222 (CHEMBL4224334)
IC50 41±n/a nM
Citation Boga, SBAlhassan, ABCooper, ABDoll, RShih, NYShipps, GDeng, YZhu, HNan, YSun, RZhu, LDesai, JPatel, MMuppalla, KGao, XWang, JYao, XKelly, JGudipati, SPaliwal, STsui, HCWang, TSherborne, BXiao, LHruza, ABuevich, AZhang, LKHesk, DSamatar, AACarr, DLong, BBlack, SDayananth, PWindsor, WKirschmeier, PBishop, R Discovery of 3(S)-thiomethyl pyrrolidine ERK inhibitors for oncology. Bioorg Med Chem Lett28:2029-2034 (2018) 
 
Mitogen-activated protein kinase 1
Name:Mitogen-activated protein kinase 1
Type:Ser/Thr Protein Kinase
Mol. Mass.:41392.76
Organism:Homo sapiens (Human)
Description:P28482
Residue:360
BDBM103290
NameBDBM103290
Synonyms:US8546404, 412
TypeSmall organic molecule
Emp. Form.C37H36FN7O3
Mol. Mass.645.7252
SMILESCOC[C@]1(CCN(CC(=O)N2CCC(=CC2)c2ccc(cc2)-c2ncccn2)C1)C(=O)Nc1ccc2[nH]nc(-c3ccc(F)cc3)c2c1