Reaction Details
TargetLysine-specific histone demethylase 1A
LigandBDBM50346534
Substrate/Competitorn/a
Meas. Tech.ChEMBL_1782167 (CHEMBL4253684)
IC50 1900±n/a nM
Citation Schulz-Fincke, JHau, MBarth, JRobaa, DWillmann, DKürner, AHaas, JGreve, GHaydn, TFulda, SLübbert, MLüdeke, SBerg, TSippl, WSchüle, RJung, M Structure-activity studies on N-Substituted tranylcypromine derivatives lead to selective inhibitors of lysine specific demethylase 1 (LSD1) and potent inducers of leukemic cell differentiation. Eur J Med Chem144:52-67 (2018) 
 
Lysine-specific histone demethylase 1A
Name:Lysine-specific histone demethylase 1A
Type:Enzyme
Mol. Mass.:92901.01
Organism:Homo sapiens (Human)
Description:O60341
Residue:852
BDBM50346534
NameBDBM50346534
Synonyms:CHEMBL1797705
TypeSmall organic molecule
Emp. Form.C27H29N3O3
Mol. Mass.443.5375
SMILESN[C@H]1C[C@@H]1c1cccc(OCC[C@H](NC(=O)c2ccccc2)C(=O)NCc2ccccc2)c1