Reaction Details
TargetDopamine beta-hydroxylase
LigandBDBM50241361
Substrate/Competitorn/a
Meas. Tech.ChEMBL_59269 (CHEMBL872495)
pH6.6±n/a
Ki 716000±n/a nM
Commentsextracted
Citation Kruse, LIKaiser, CDeWolf, WEFrazee, JSGarvey, EHilbert, ELFaulkner, WAFlaim, KESawyer, JLBerkowitz, BA Multisubstrate inhibitors of dopamine beta-hydroxylase. 1. Some 1-phenyl and 1-phenyl-bridged derivatives of imidazole-2-thione. J Med Chem29:2465-72 (1987) Dopamine beta-hydroxylase
Name:Dopamine beta-hydroxylase
Type:PROTEIN
Mol. Mass.:68136.39
Organism:Bos taurus
Description:ChEMBL_50738
Residue:610
BDBM50241361
NameBDBM50241361
Synonyms:CHEMBL1515 US9138393, Methimazole | US9144538, Methimazole
TypeSmall organic molecule
Emp. Form.C4H6N2S
Mol. Mass.114.169
SMILESCn1cc[nH]c1=S