Reaction Details
TargetAlpha-2A adrenergic receptor
LigandBDBM50118703
Substrate/Competitorn/a
Meas. Tech.ChEMBL_33207 (CHEMBL643232)
Ki 33±n/a nM
Citation Altenbach, RJKhilevich, AKolasa, TRohde, JJBhatia, PAPatel, MVSearle, XBYang, FBunnelle, WHTietje, KBayburt, EKCarroll, WAMeyer, MDHenry, RBuckner, SAKuk, JDaza, AVMilicic, IVCain, JCKang, CHIreland, LMCarr, TLMiller, TRHancock, AANakane, MEsbenshade, TABrune, MEO'Neill, ABGauvin, DMKatwala, SPHolladay, MWBrioni, JDSullivan, JP Synthesis and structure-activity studies on N-[5-(1H-imidazol-4-yl)-5,6,7,8-tetrahydro-1-naphthalenyl]methanesulfonamide, an imidazole-containing alpha(1A)-adrenoceptor agonist. J Med Chem47:3220-35 (2004) 
 
Alpha-2A adrenergic receptor
Name:Alpha-2A adrenergic receptor
Type:Enzyme
Mol. Mass.:48979.91
Organism:Homo sapiens (Human)
Description:P08913
Residue:465
BDBM50118703
NameBDBM50118703
Synonyms:CHEMBL109783 | N-[5-(4,5-Dihydro-1H-imidazol-2-yl)-2-hydroxy-5,6,7,8-tetrahydro-naphthalen-1-yl]-methanesulfonamide
TypeSmall organic molecule
Emp. Form.C14H19N3O3S
Mol. Mass.309.384
SMILESCS(=O)(=O)Nc1c(O)ccc2C(CCCc12)C1=NCCN1