Reaction Details
TargetGastrin/cholecystokinin type B receptor
LigandBDBM50470629
Substrate/Competitorn/a
Meas. Tech.ChEMBL_321078 (CHEMBL872158)
Ki 1.6±n/a nM
Citation Low, CMBuck, IMCooke, TCushnir, JRKalindjian, SBKotecha, APether, MJShankley, NPVinter, JGWright, L Scaffold hopping with molecular field points: identification of a cholecystokinin-2 (CCK2) receptor pharmacophore and its use in the design of a prototypical series of pyrrole- and imidazole-based CCK2 antagonists. J Med Chem48:6790-802 (2005) 
 
Gastrin/cholecystokinin type B receptor
Name:Gastrin/cholecystokinin type B receptor
Type:Enzyme Catalytic Domain
Mol. Mass.:49196.59
Organism:MOUSE
Description:Cholecystokinin A CCKBR MOUSE::P56481
Residue:453
BDBM50470629
NameBDBM50470629
Synonyms:CHEMBL342616
TypeSmall organic molecule
Emp. Form.C46H45N3O7
Mol. Mass.751.8654
SMILESOC(=O)c1cc(NC(=O)[C@H](Cc2ccccc2)NC(=O)C2C(C3c4ccccc4C2c2ccccc32)C(=O)NCC23CC4CC(CC(C4)C2)C3)cc(c1)C(O)=O