Reaction Details
TargetSigma intracellular receptor 2
LigandBDBM50467780
Substrate/Competitorn/a
Meas. Tech.ChEMBL_1804490 (CHEMBL4303093)
Ki 1000±n/a nM
Citation Gordon, DEJang, GMBouhaddou, MXu, JObernier, KWhite, KMO'Meara, MJRezelj, VVGuo, JZSwaney, DLTummino, TAHüttenhain, RKaake, RMRichards, ALTutuncuoglu, BFoussard, HBatra, JHaas, KModak, MKim, MHaas, PPolacco, BJBraberg, HFabius, JMEckhardt, MSoucheray, MBennett, MJCakir, MMcGregor, MJLi, QMeyer, BRoesch, FVallet, TMac Kain, AMiorin, LMoreno, ENaing, ZZCZhou, YPeng, SShi, YZhang, ZShen, WKirby, ITMelnyk, JEChorba, JSLou, KDai, SABarrio-Hernandez, IMemon, DHernandez-Armenta, CLyu, JMathy, CJPPerica, TPilla, KBGanesan, SJSaltzberg, DJRakesh, RLiu, XRosenthal, SBCalviello, LVenkataramanan, SLiboy-Lugo, JLin, YHuang, XPLiu, YWankowicz, SABohn, MSafari, MUgur, FSKoh, CSavar, NSTran, QDShengjuler, DFletcher, SJO'Neal, MCCai, YChang, JCJBroadhurst, DJKlippsten, SSharp, PPWenzell, NAKuzuoglu-Ozturk, DWang, HYTrenker, RYoung, JMCavero, DAHiatt, JRoth, TLRathore, USubramanian, ANoack, JHubert, MStroud, RMFrankel, ADRosenberg, OSVerba, KAAgard, DAOtt, MEmerman, MJura, Nvon Zastrow, MVerdin, EAshworth, ASchwartz, Od'Enfert, CMukherjee, SJacobson, MMalik, HSFujimori, DGIdeker, TCraik, CSFloor, SNFraser, JSGross, JDSali, ARoth, BLRuggero, DTaunton, JKortemme, TBeltrao, PVignuzzi, MGarcía-Sastre, AShokat, KMShoichet, BKKrogan, NJ A SARS-CoV-2 protein interaction map reveals targets for drug repurposing. Nature583:459-468 (2020) 
 
Sigma intracellular receptor 2
Name:Sigma intracellular receptor 2
Type:Protein
Mol. Mass.:20857.20
Organism:Homo sapiens (Human)
Description:Q5BJF2
Residue:176
BDBM50467780
NameBDBM50467780
Synonyms:CHEBI:5801 acs.jmedchem.1c00409_ST.817 | med.21724, Compound 9
TypeSmall organic molecule
Emp. Form.C18H26ClN3O
Mol. Mass.335.872
SMILESCCN(CCO)CCCC(C)Nc1ccnc2cc(Cl)ccc12