Reaction Details
TargetMuscarinic acetylcholine receptor M1
LigandBDBM50253157
Substrate/Competitorn/a
Meas. Tech.ChEMBL_1804487 (CHEMBL4303090)
Ki 20±n/a nM
Citation Gordon, DEJang, GMBouhaddou, MXu, JObernier, KWhite, KMO'Meara, MJRezelj, VVGuo, JZSwaney, DLTummino, TAHüttenhain, RKaake, RMRichards, ALTutuncuoglu, BFoussard, HBatra, JHaas, KModak, MKim, MHaas, PPolacco, BJBraberg, HFabius, JMEckhardt, MSoucheray, MBennett, MJCakir, MMcGregor, MJLi, QMeyer, BRoesch, FVallet, TMac Kain, AMiorin, LMoreno, ENaing, ZZCZhou, YPeng, SShi, YZhang, ZShen, WKirby, ITMelnyk, JEChorba, JSLou, KDai, SABarrio-Hernandez, IMemon, DHernandez-Armenta, CLyu, JMathy, CJPPerica, TPilla, KBGanesan, SJSaltzberg, DJRakesh, RLiu, XRosenthal, SBCalviello, LVenkataramanan, SLiboy-Lugo, JLin, YHuang, XPLiu, YWankowicz, SABohn, MSafari, MUgur, FSKoh, CSavar, NSTran, QDShengjuler, DFletcher, SJO'Neal, MCCai, YChang, JCJBroadhurst, DJKlippsten, SSharp, PPWenzell, NAKuzuoglu-Ozturk, DWang, HYTrenker, RYoung, JMCavero, DAHiatt, JRoth, TLRathore, USubramanian, ANoack, JHubert, MStroud, RMFrankel, ADRosenberg, OSVerba, KAAgard, DAOtt, MEmerman, MJura, Nvon Zastrow, MVerdin, EAshworth, ASchwartz, Od'Enfert, CMukherjee, SJacobson, MMalik, HSFujimori, DGIdeker, TCraik, CSFloor, SNFraser, JSGross, JDSali, ARoth, BLRuggero, DTaunton, JKortemme, TBeltrao, PVignuzzi, MGarcía-Sastre, AShokat, KMShoichet, BKKrogan, NJ A SARS-CoV-2 protein interaction map reveals targets for drug repurposing. Nature583:459-468 (2020) 
 
Muscarinic acetylcholine receptor M1
Name:Muscarinic acetylcholine receptor M1
Type:Protein
Mol. Mass.:51442.54
Organism:Homo sapiens (Human)
Description:P11229
Residue:460
BDBM50253157
NameBDBM50253157
Synonyms:(+)-(2R)-2-(2-(((R)-p-chloro-alpha-methyl-alpha-phenylbenzyl)oxy)ethyl)-1-methylpyrrolidine (2R)-2-{2-[(1R)-1-(4-chlorophenyl)-1-phenylethoxy]ethyl}-1-methylpyrrolidine CLEMASTINE
TypeSmall organic molecule
Emp. Form.C21H26ClNO
Mol. Mass.343.89
SMILESCN1CCC[C@@H]1CCO[C@](C)(c1ccccc1)c1ccc(Cl)cc1