Reaction Details
TargetAlpha-2B adrenergic receptor
LigandBDBM50251208
Substrate/Competitorn/a
Meas. Tech.ChEMBL_1804493 (CHEMBL4303096)
Ki 20417±n/a nM
Citation Gordon, DEJang, GMBouhaddou, MXu, JObernier, KWhite, KMO'Meara, MJRezelj, VVGuo, JZSwaney, DLTummino, TAHüttenhain, RKaake, RMRichards, ALTutuncuoglu, BFoussard, HBatra, JHaas, KModak, MKim, MHaas, PPolacco, BJBraberg, HFabius, JMEckhardt, MSoucheray, MBennett, MJCakir, MMcGregor, MJLi, QMeyer, BRoesch, FVallet, TMac Kain, AMiorin, LMoreno, ENaing, ZZCZhou, YPeng, SShi, YZhang, ZShen, WKirby, ITMelnyk, JEChorba, JSLou, KDai, SABarrio-Hernandez, IMemon, DHernandez-Armenta, CLyu, JMathy, CJPPerica, TPilla, KBGanesan, SJSaltzberg, DJRakesh, RLiu, XRosenthal, SBCalviello, LVenkataramanan, SLiboy-Lugo, JLin, YHuang, XPLiu, YWankowicz, SABohn, MSafari, MUgur, FSKoh, CSavar, NSTran, QDShengjuler, DFletcher, SJO'Neal, MCCai, YChang, JCJBroadhurst, DJKlippsten, SSharp, PPWenzell, NAKuzuoglu-Ozturk, DWang, HYTrenker, RYoung, JMCavero, DAHiatt, JRoth, TLRathore, USubramanian, ANoack, JHubert, MStroud, RMFrankel, ADRosenberg, OSVerba, KAAgard, DAOtt, MEmerman, MJura, Nvon Zastrow, MVerdin, EAshworth, ASchwartz, Od'Enfert, CMukherjee, SJacobson, MMalik, HSFujimori, DGIdeker, TCraik, CSFloor, SNFraser, JSGross, JDSali, ARoth, BLRuggero, DTaunton, JKortemme, TBeltrao, PVignuzzi, MGarcía-Sastre, AShokat, KMShoichet, BKKrogan, NJ A SARS-CoV-2 protein interaction map reveals targets for drug repurposing. Nature583:459-468 (2020) 
 
Alpha-2B adrenergic receptor
Name:Alpha-2B adrenergic receptor
Type:Enzyme
Mol. Mass.:49964.20
Organism:Homo sapiens (Human)
Description:P18089
Residue:450
BDBM50251208
NameBDBM50251208
Synonyms:CHEMBL4088272
TypeSmall organic molecule
Emp. Form.C18H22N2O
Mol. Mass.282.3801
SMILESCCCN1CCC=C(C1)c1cc(no1)-c1ccc(C)cc1