Reaction Details
TargetSerine/threonine-protein kinase B-raf
LigandBDBM50484212
Substrate/Competitorn/a
Meas. Tech.ChEMBL_766559 (CHEMBL1827040)
IC50 0.200000±n/a nM
Citation Wenglowsky, SAhrendt, KABuckmelter, AJFeng, BGloor, SLGradl, SGrina, JHansen, JDLaird, ERLunghofer, PMathieu, SMoreno, DNewhouse, BRen, LRisom, TRudolph, JSeo, JSturgis, HLVoegtli, WCWen, Z Pyrazolopyridine inhibitors of B-RafV600E. Part 2: structure-activity relationships. Bioorg Med Chem Lett21:5533-7 (2011) 
 
Serine/threonine-protein kinase B-raf
Name:Serine/threonine-protein kinase B-raf
Type:Serine/threonine-protein kinase
Mol. Mass.:84446.00
Organism:Homo sapiens (Human)
Description:P15056
Residue:766
BDBM50484212
NameBDBM50484212
Synonyms:CHEMBL1822264
TypeSmall organic molecule
Emp. Form.C18H13F2N5O4S2
Mol. Mass.465.454
SMILESCOc1n[nH]c2ncc(NC(=O)c3c(F)ccc(NS(=O)(=O)c4cccs4)c3F)cc12