Reaction Details
TargetReverse transcriptase/RNaseH
LigandBDBM50029672
Substrate/Competitorn/a
Meas. Tech.ChEMBL_195839 (CHEMBL799138)
IC50>4000±n/a nM
Citation Dollé, VFan, ENguyen, CHAubertin, AMKirn, AAndreola, MLJamieson, GTarrago-Litvak, LBisagni, E A new series of pyridinone derivatives as potent non-nucleoside human immunodeficiency virus type 1 specific reverse transcriptase inhibitors. J Med Chem38:4679-86 (1995) Reverse transcriptase/RNaseH
Name:Reverse transcriptase/RNaseH
Type:PROTEIN
Mol. Mass.:65229.15
Organism:Human immunodeficiency virus 1
Description:ChEMBL_1473730
Residue:566
BDBM50029672
NameBDBM50029672
Synonyms:CHEMBL341880 | N-[4-(3,5-Dimethyl-phenylsulfanyl)-5-methyl-2-oxo-1,2-dihydro-pyridin-3-yl]-acetamide
TypeSmall organic molecule
Emp. Form.C16H18N2O2S
Mol. Mass.302.391
SMILESCC(=O)Nc1c(Sc2cc(C)cc(C)c2)c(C)c[nH]c1=O