Reaction Details
TargetMelanocyte-stimulating hormone receptor
LigandBDBM50029748
Substrate/Competitorn/a
Meas. Tech.ChEMBL_105822 (CHEMBL716482)
EC50 0.4±n/a nM
Citation Haskell-Luevano, CBoteju, LWMiwa, HDickinson, CGantz, IYamada, THadley, MEHruby, VJ Topographical modification of melanotropin peptide analogues with beta-methyltryptophan isomers at position 9 leads to differential potencies and prolonged biological activities. J Med Chem38:4720-9 (1995) Melanocyte-stimulating hormone receptor
Name:Melanocyte-stimulating hormone receptor
Type:Enzyme
Mol. Mass.:34717.23
Organism:Homo sapiens (Human)
Description:Q01726
Residue:317
BDBM50029748
NameBDBM50029748
Synonyms:(2R,3R)-15-(2-Acetylamino-hexanoylamino)-9-benzyl-6-(3-guanidino-propyl)-12-(3H-imidazol-4-ylmethyl)-3-(1H-indol-3-ylmethyl)-4-methyl-2,5,8,11,14,17-hexaoxo-1,4,7,10,13,18hexaaza-cyclotricosane-23-carboxylic acid amide | CHEMBL2364555
TypeSmall organic molecule
Emp. Form.C51H71N15O9
Mol. Mass.1038.2045
SMILES[H][C@]1(NC(=O)[C@H](CCCN=C(N)N)NC(=O)[C@@H](Cc2ccccc2)NC(=O)[C@H](Cc2c[nH]cn2)NC(=O)[C@H](CC(=O)NCCCC[C@H](NC1=O)C(N)=O)NC(=O)[C@H](CCCC)NC(C)=O)[C@@H](C)c1c[nH]c2ccccc12