Reaction Details
TargetUridine phosphorylase 1
LigandBDBM50031001
Substrate/Competitorn/a
Meas. Tech.ChEMBL_212951 (CHEMBL873996)
IC50 840.0±n/a nM
Citation Orr, GFMusso, DLBoswell, GEKelley, JLJoyner, SSDavis, STBaccanari, DP Inhibition of uridine phosphorylase: synthesis and structure-activity relationships of aryl-substituted 5-benzyluracils and 1-[(2-hydroxyethoxy)methyl]-5-benzyluracils. J Med Chem38:3850-6 (1995) Uridine phosphorylase 1
Name:Uridine phosphorylase 1
Type:PROTEIN
Mol. Mass.:34086.29
Organism:Mus musculus
Description:ChEMBL_212951
Residue:311
BDBM50031001
NameBDBM50031001
Synonyms:5-(3-Propoxy-benzyl)-1H-pyrimidine-2,4-dione | CHEMBL124639
TypeSmall organic molecule
Emp. Form.C14H16N2O3
Mol. Mass.260.2884
SMILESCCCOc1cccc(Cc2c[nH]c(=O)[nH]c2=O)c1