Reaction Details
TargetLactase/phlorizin hydrolase
LigandBDBM50031481
Substrate/Competitorn/a
Meas. Tech.ChEMBL_96426 (CHEMBL706374)
IC50 3600±n/a nM
Citation Asano, NKizu, HOseki, KTomioka, EMatsui, KOkamoto, MBaba, M N-alkylated nitrogen-in-the-ring sugars: conformational basis of inhibition of glycosidases and HIV-1 replication. J Med Chem38:2349-56 (1995) Lactase/phlorizin hydrolase
Name:Lactase/phlorizin hydrolase
Type:PROTEIN
Mol. Mass.:217253.31
Organism:Rattus norvegicus
Description:ChEMBL_96426
Residue:1928
BDBM50031481
NameBDBM50031481
Synonyms:(2R,3R,4R,5R)-2,5-Bis-hydroxymethyl-pyrrolidine-3,4-diol 2R,5R-dihydroxymethyl-3R,4R-dihydroxypyrrolidine | CHEMBL312653
TypeSmall organic molecule
Emp. Form.C6H13NO4
Mol. Mass.163.1717
SMILESOC[C@H]1N[C@H](CO)[C@@H](O)[C@@H]1O