Reaction Details
TargetAlpha-mannosidase
LigandBDBM50016703
Substrate/Competitorn/a
Meas. Tech.ChEMBL_32498 (CHEMBL641375)
IC50 110000±n/a nM
Citation Asano, NKizu, HOseki, KTomioka, EMatsui, KOkamoto, MBaba, M N-alkylated nitrogen-in-the-ring sugars: conformational basis of inhibition of glycosidases and HIV-1 replication. J Med Chem38:2349-56 (1995) Alpha-mannosidase
Name:Alpha-mannosidase
Synonyms:Mannosidase 2, alpha B1
Type:PROTEIN
Mol. Mass.:114350.15
Organism:Rattus norvegicus
Description:ChEMBL_32498
Residue:1009
BDBM50016703
NameBDBM50016703
TypeSmall organic molecule
Emp. Form.C5H11NO3
Mol. Mass.133.1457
SMILESOC[C@H]1NC[C@@H](O)[C@@H]1O