Reaction Details
TargetLactase/phlorizin hydrolase
LigandBDBM18353
Substrate/Competitorn/a
Meas. Tech.ChEMBL_96426 (CHEMBL706374)
IC50 4400±n/a nM
Citation Asano, NKizu, HOseki, KTomioka, EMatsui, KOkamoto, MBaba, M N-alkylated nitrogen-in-the-ring sugars: conformational basis of inhibition of glycosidases and HIV-1 replication. J Med Chem38:2349-56 (1995) Lactase/phlorizin hydrolase
Name:Lactase/phlorizin hydrolase
Type:PROTEIN
Mol. Mass.:217253.31
Organism:Rattus norvegicus
Description:ChEMBL_96426
Residue:1928
BDBM18353
NameBDBM18353
Synonyms:(2R,3R,4R,5S)-2-(hydroxymethyl)-1-methylpiperidine-3,4,5-triol N-Methyl-DNJ | US9181184, 2
Typenatural product
Emp. Form.C7H15NO4
Mol. Mass.177.1983
SMILESCN1C[C@H](O)[C@@H](O)[C@H](O)[C@H]1CO