Reaction Details
TargetAlpha-mannosidase 2
LigandBDBM50031483
Substrate/Competitorn/a
Meas. Tech.ChEMBL_32391 (CHEMBL647923)
IC50<50000±n/a nM
Citation Asano, NKizu, HOseki, KTomioka, EMatsui, KOkamoto, MBaba, M N-alkylated nitrogen-in-the-ring sugars: conformational basis of inhibition of glycosidases and HIV-1 replication. J Med Chem38:2349-56 (1995) Alpha-mannosidase 2
Name:Alpha-mannosidase 2
Type:PROTEIN
Mol. Mass.:131265.36
Organism:Rattus norvegicus
Description:ChEMBL_32391
Residue:1148
BDBM50031483
NameBDBM50031483
Synonyms:(2R,3R,4R,5R)-2,5-Bis-hydroxymethyl-1-methyl-pyrrolidine-3,4-diol | CHEMBL310231
TypeSmall organic molecule
Emp. Form.C7H15NO4
Mol. Mass.177.1983
SMILESCN1[C@H](CO)[C@@H](O)[C@H](O)[C@H]1CO