Reaction Details
TargetMu-type opioid receptor
LigandBDBM50033655
Substrate/Competitorn/a
Meas. Tech.ChEBML_136067
IC50 24±n/a nM
Citation Sebastian, ABidlack, JMJiang, QDeecher, DTeitler, MGlick, SDArcher, S 14 beta-[(p-nitrocinnamoyl)amino]morphinones, 14 beta-[(p-nitrocinnamoyl)amino]-7,8-dihydromorphinones, and their codeinone analogues: synthesis and receptor activity. J Med Chem36:3154-60 (1993) Mu-type opioid receptor
Name:Mu-type opioid receptor
Type:Enzyme Catalytic Domain
Mol. Mass.:45038.37
Organism:CALF
Description:OPIATE Mu 2 0 CALF::P79350
Residue:401
BDBM50033655
NameBDBM50033655
Synonyms:1N-[4-cyclopropylmethyl-10-hydroxy-13-methyl-14-oxo-(13R,17S)-12-oxa-4-azapentacyclo[9.6.1.01,13.05,17.07,18]octadeca-7(18),8,10-trien-17-yl]-3-(4-nitrophenyl)propanamide | CHEMBL105827
TypeSmall organic molecule
Emp. Form.C30H33N3O6
Mol. Mass.531.5995
SMILESC[C@@]12Oc3c4c(CC5N(CC6CC6)CCC14[C@]5(CCC2=O)NC(=O)CCc1ccc(cc1)[N+]([O-])=O)ccc3O