Reaction Details
TargetDelta-type opioid receptor
LigandBDBM50033656
Substrate/Competitorn/a
Meas. Tech.ChEBML_146726
IC50 25±n/a nM
Citation Sebastian, ABidlack, JMJiang, QDeecher, DTeitler, MGlick, SDArcher, S 14 beta-[(p-nitrocinnamoyl)amino]morphinones, 14 beta-[(p-nitrocinnamoyl)amino]-7,8-dihydromorphinones, and their codeinone analogues: synthesis and receptor activity. J Med Chem36:3154-60 (1993) Delta-type opioid receptor
Name:Delta-type opioid receptor
Type:G Protein-Coupled Receptor (GPCR)
Mol. Mass.:40382.98
Organism:Homo sapiens (Human)
Description:Competition binding assays were carried out using membrane preparations from transfected HN9.10 cells that constitutively expressed the delta opioid receptor.
Residue:372
BDBM50033656
NameBDBM50033656
Synonyms:1N-[4-cyclopropylmethyl-10-hydroxy-13-methyl-14-oxo-(13R,17S)-12-oxa-4-azapentacyclo[9.6.1.01,13.05,17.07,18]octadeca-7(18),8,10,15-tetraen-17-yl]-4-(4-nitrophenyl)-(Z)-2-butenamide | CHEMBL106189
TypeSmall organic molecule
Emp. Form.C30H29N3O6
Mol. Mass.527.5678
SMILESC[C@@]12Oc3c4c(CC5N(CC6CC6)CCC14[C@@]5(NC(=O)\C=C\c1ccc(cc1)[N+]([O-])=O)C=CC2=O)ccc3O