Reaction Details
TargetThromboxane-A synthase
LigandBDBM50010960
Substrate/Competitorn/a
Meas. Tech.ChEMBL_210285 (CHEMBL808531)
IC50 20±n/a nM
Citation Ackerley, NBrewster, AGBrown, GRClarke, DSFoubister, AJGriffin, SJHudson, JASmithers, MJWhittamore, PR A novel approach to dual-acting thromboxane receptor antagonist/synthase inhibitors based on the link of 1,3-dioxane-thromboxane receptor antagonists and -thromboxane synthase inhibitors. J Med Chem38:1608-28 (1995) Thromboxane-A synthase
Name:Thromboxane-A synthase
Type:Enzyme
Mol. Mass.:60524.67
Organism:Homo sapiens (Human)
Description:P24557
Residue:533
BDBM50010960
NameBDBM50010960
Synonyms:(E)-7-Phenyl-7-pyridin-3-yl-hept-6-enoic acid 7-Phenyl-7-pyridin-3-yl-hept-6-enoic acid(CV-4151) CV-4151
TypeSmall organic molecule
Emp. Form.C18H19NO2
Mol. Mass.281.349
SMILESOC(=O)CCCC\C=C(/c1ccccc1)c1cccnc1