Reaction Details
TargetThromboxane-A synthase
LigandBDBM50034767
Substrate/Competitorn/a
Meas. Tech.ChEMBL_210285 (CHEMBL808531)
IC50 10±n/a nM
Citation Ackerley, NBrewster, AGBrown, GRClarke, DSFoubister, AJGriffin, SJHudson, JASmithers, MJWhittamore, PR A novel approach to dual-acting thromboxane receptor antagonist/synthase inhibitors based on the link of 1,3-dioxane-thromboxane receptor antagonists and -thromboxane synthase inhibitors. J Med Chem38:1608-28 (1995) Thromboxane-A synthase
Name:Thromboxane-A synthase
Type:Enzyme
Mol. Mass.:60524.67
Organism:Homo sapiens (Human)
Description:P24557
Residue:533
BDBM50034767
NameBDBM50034767
Synonyms:(E)-7-(4-{5-[(2S,4S,5R)-5-((Z)-5-Carboxy-pent-2-enyl)-4-(2-hydroxy-phenyl)-[1,3]dioxan-2-yl]-pentyloxy}-phenyl)-7-pyridin-3-yl-hept-6-enoic acid | CHEMBL297385
TypeSmall organic molecule
Emp. Form.C39H47NO8
Mol. Mass.657.7924
SMILESOC(=O)CCCC\C=C(/c1ccc(OCCCCC[C@H]2OC[C@@H](C\C=C/CCC(O)=O)[C@H](O2)c2ccccc2O)cc1)c1cccnc1