Reaction Details
TargetGag-Pol polyprotein [489-587]
LigandBDBM50035629
Substrate/Competitorn/a
Meas. Tech.ChEMBL_159454 (CHEMBL766799)
IC50 212.42±n/a nM
Citation Holloway, MKWai, JMHalgren, TAFitzgerald, PMVacca, JPDorsey, BDLevin, RBThompson, WJChen, LJdeSolms, SJ A priori prediction of activity for HIV-1 protease inhibitors employing energy minimization in the active site. J Med Chem38:305-17 (1995) Gag-Pol polyprotein [489-587]
Name:Gag-Pol polyprotein [489-587]
Type:Enzyme Subunit
Mol. Mass.:10781.16
Organism:Human immunodeficiency virus type 1
Description:P04585[489-587]
Residue:99
BDBM50035629
NameBDBM50035629
Synonyms:CHEMBL105299 [1-Benzyl-2-hydroxy-4-(2-hydroxy-1-methyl-indan-1-ylcarbamoyl)-5-phenyl-pentyl]-carbamic acid tert-butyl ester
TypeSmall organic molecule
Emp. Form.C34H42N2O5
Mol. Mass.558.7077
SMILESCC(C)(C)OC(=O)N[C@@H](Cc1ccccc1)[C@@H](O)C[C@@H](Cc1ccccc1)C(=O)N[C@]1(C)[C@H](O)Cc2ccccc12