Reaction Details
TargetMatrix metalloproteinase-9
LigandBDBM50040583
Substrate/Competitorn/a
Meas. Tech.ChEMBL_102113 (CHEMBL712038)
IC50 2.1±n/a nM
Citation Brown, FKBrown, PJBickett, DMChambers, CLDavies, HGDeaton, DNDrewry, DFoley, MMcElroy, ABGregson, M Matrix metalloproteinase inhibitors containing a (carboxyalkyl)amino zinc ligand: modification of the P1 and P2' residues. J Med Chem37:674-88 (1994) Matrix metalloproteinase-9
Name:Matrix metalloproteinase-9
Type:Enzyme
Mol. Mass.:78452.28
Organism:Homo sapiens (Human)
Description:P14780
Residue:707
BDBM50040583
NameBDBM50040583
Synonyms:(R)-4-(1,3-Dioxo-5-propoxy-1,3-dihydro-isoindol-2-yl)-2-[(S)-3-methyl-1-((S)-1-methylcarbamoyl-2-phenyl-ethylcarbamoyl)-butylamino]-butyric acid | CHEMBL352232
TypeSmall organic molecule
Emp. Form.C31H40N4O7
Mol. Mass.580.6719
SMILESCCCOc1ccc2C(=O)N(CC[C@@H](N[C@@H](CC(C)C)C(=O)N[C@@H](Cc3ccccc3)C(=O)NC)C(O)=O)C(=O)c2c1