Reaction Details
TargetGlucagon-like peptide 1 receptor
LigandBDBM50495417
Substrate/Competitorn/a
Meas. Tech.ChEMBL_1286940 (CHEMBL3110983)
EC50 0.003±n/a nM
Citation Han, JSun, LChu, YLi, ZHuang, DZhu, XQian, HHuang, W Design, synthesis, and biological activity of novel dicoumarol glucagon-like peptide 1 conjugates. J Med Chem56:9955-68 (2013) 
 
Glucagon-like peptide 1 receptor
Name:Glucagon-like peptide 1 receptor
Type:Enzyme
Mol. Mass.:53035.78
Organism:Homo sapiens (Human)
Description:P43220
Residue:463
BDBM50495417
NameBDBM50495417
Synonyms:CHEMBL3110318
TypeSmall organic molecule
Emp. Form.C183H251N43O55S
Mol. Mass.3965.271
SMILESCC[C@H](C)[C@H](NC(=O)[C@H](Cc1ccccc1)NC(=O)[C@H](CCC(O)=O)NC(=O)[C@H](CCCCN)NC(=O)[C@H](C)NC(=O)[C@H](C)NC(=O)[C@H](CCC(N)=O)NC(=O)CNC(=O)[C@H](CCC(O)=O)NC(=O)[C@H](CC(C)C)NC(=O)[C@H](Cc1ccc(O)cc1)NC(=O)[C@H](CO)NC(=O)[C@H](CO)NC(=O)[C@@H](NC(=O)[C@H](CC(O)=O)NC(=O)[C@H](CO)NC(=O)[C@@H](NC(=O)[C@H](Cc1ccccc1)NC(=O)[C@@H](NC(=O)CNC(=O)[C@H](CCC(O)=O)NC(=O)CNC(=O)[C@@H](N)Cc1cnc[nH]1)[C@@H](C)O)[C@@H](C)O)C(C)C)C(=O)N[C@@H](C)C(=O)N[C@@H](Cc1c[nH]c2ccccc12)C(=O)N[C@@H](CC(C)C)C(=O)N[C@@H](C(C)C)C(=O)N[C@@H](CCCCN)C(=O)NCC(=O)N[C@@H](CCCNC(N)=N)C(=O)N[C@@H](CSC1CC(=O)N(CCC(=O)Nc2ccc(cc2)C(c2c(O)c3ccccc3oc2=O)c2c(O)c3ccccc3oc2=O)C1=O)C(N)=O