Reaction Details
TargetType-1 angiotensin II receptor
LigandBDBM50009718
Substrate/Competitorn/a
Meas. Tech.ChEBML_34644
IC50 0.540000±n/a nM
Citation Dhanoa, DSBagley, SWChang, RSLotti, VJChen, TBKivlighn, SDZingaro, GJSiegl, PKChakravarty, PKPatchett, AA (Dipropylphenoxy)phenylacetic acids: a new generation of nonpeptide angiotensin II receptor antagonists. J Med Chem36:3738-42 (1994) Type-1 angiotensin II receptor
Name:Type-1 angiotensin II receptor
Type:Enzyme Catalytic Domain
Mol. Mass.:41009.15
Organism:RABBIT
Description:ANGIOTENSIN AT1 AGTR1 RABBIT::P34976
Residue:359
BDBM50009718
NameBDBM50009718
Synonyms:2-Ethyl-5,7-dimethyl-3-[2'-(1H-tetrazol-5-yl)-biphenyl-4-ylmethyl]-3H-imidazo[4,5-b]pyridine 2-Ethyl-5,7-dimethyl-3-[2'-(1H-tetrazol-5-yl)-biphenyl-4-ylmethyl]-3H-imidazo[4,5-b]pyridine (L158809) 2-Ethyl-5,7-dimethyl-3-[2'-(2H-tetrazol-5-yl)-biphenyl-4-ylmethyl]-3H-imidazo[4,5-b]pyridine(L-158809) CHEMBL7550 | L-158809
TypeSmall organic molecule
Emp. Form.C24H23N7
Mol. Mass.409.4863
SMILESCCc1nc2c(C)cc(C)nc2n1Cc1ccc(cc1)-c1ccccc1-c1nnn[nH]1