Reaction Details
TargetTyrosine-protein kinase Lck
LigandBDBM50029224
Substrate/Competitorn/a
Meas. Tech.ChEMBL_161963 (CHEMBL769387)
IC50 25000±n/a nM
Citation Burke, TRLim, BMarquez, VELi, ZHBolen, JBStefanova, IHorak, ID Bicyclic compounds as ring-constrained inhibitors of protein-tyrosine kinase p56lck. J Med Chem36:425-32 (1993) Tyrosine-protein kinase Lck
Name:Tyrosine-protein kinase Lck
Type:n/a
Mol. Mass.:57987.83
Organism:Homo sapiens (Human)
Description:P06239
Residue:509
BDBM50029224
NameBDBM50029224
Synonyms:5,6-Dihydroxy-naphthalene-2-carboxylic acid methyl ester | CHEMBL18276
TypeSmall organic molecule
Emp. Form.C12H10O4
Mol. Mass.218.2054
SMILESCOC(=O)c1ccc2c(O)c(O)ccc2c1