Reaction Details
TargetAcyl-CoA:cholesterol acyltransferase
LigandBDBM50047595
Substrate/Competitorn/a
Meas. Tech.ChEBML_28332
IC50 12±n/a nM
Citation Kimura, TWatanabe, NMatsui, MHayashi, KTanaka, HOhtsuka, ISaeki, TKogushi, MKabayashi, HAkasaka, K Structure-activity relationship of a series of phenylureas linked to 4-phenylimidazole. Novel potent inhibitors of acyl-CoA:cholesterol O-acyltransferase with antiatherosclerotic activity. 2. J Med Chem36:1641-53 (1993) Acyl-CoA:cholesterol acyltransferase
Name:Acyl-CoA:cholesterol acyltransferase
Synonyms:ACAT
Type:n/a
Mol. Mass.:35405.31
Organism:Oryctolagus cuniculus
Description:n/a
Residue:305
BDBM50047595
NameBDBM50047595
TypeSmall organic molecule
Emp. Form.C27H36N4O2
Mol. Mass.448.6003
SMILESCCCCNC(=O)Nc1c(C)cccc1OCCCn1cnc(c1C(C)C)-c1ccccc1